{"text_format":"3","workbook":"xlsx","n_sheets":2,"sheets":["人员名单","Sheet1"],"not_rendered":{"external_links":2,"defined_names":2},"read":"whole","date_system":"1900"}

{"sheet":"人员名单","index":0,"n_rows":145,"n_cols":11,"rows_kept":145,"merged":[[0,0,0,10]]}
["云南省广播电视局2021年事业单位公开招聘工作人员综合成绩"]
["招考单位名称","报考职位","报考职位代码","准考证","笔试成绩","（笔试成绩÷笔试总分×100）×50%","面试成绩","面试成绩\n×50%","综合成绩","排名","是否进入\n体检环节"]
["云南省广播电视局安全播出监测中心","广播电视工程","15399099157001001","3153993310202",{"v":217.5,"d":"217.50"},36.25,83.6,{"v":41.8,"d":"41.80"},78.05,1,"是"]
["云南省广播电视局安全播出监测中心","广播电视工程","15399099157001001","3153993309329",{"v":211.5,"d":"211.50"},35.25,82.8,{"v":41.4,"d":"41.40"},76.65,2,"是"]
["云南省广播电视局安全播出监测中心","广播电视工程","15399099157001001","3153993206218",{"v":206.5,"d":"206.50"},{"v":34.4166666666667,"d":"34.42"},84.2,{"v":42.1,"d":"42.10"},{"v":76.5166666666667,"d":"76.52"},3,"是"]
["云南省广播电视局安全播出监测中心","广播电视工程","15399099157001001","3153993309915",{"v":211,"d":"211.00"},{"v":35.1666666666667,"d":"35.17"},80.6,{"v":40.3,"d":"40.30"},{"v":75.4666666666667,"d":"75.47"},4,"否"]
["云南省广播电视局安全播出监测中心","广播电视工程","15399099157001001","3153993313623",{"v":205,"d":"205.00"},{"v":34.1666666666667,"d":"34.17"},82.2,{"v":41.1,"d":"41.10"},{"v":75.2666666666667,"d":"75.27"},5,"否"]
["云南省广播电视局安全播出监测中心","广播电视工程","15399099157001001","3153993310321",{"v":205,"d":"205.00"},{"v":34.1666666666667,"d":"34.17"},81.6,{"v":40.8,"d":"40.80"},{"v":74.9666666666667,"d":"74.97"},6,"否"]
["云南省广播电视局安全播出监测中心","广播电视工程","15399099157001001","3153993309624",{"v":206,"d":"206.00"},{"v":34.3333333333333,"d":"34.33"},79,{"v":39.5,"d":"39.50"},{"v":73.8333333333333,"d":"73.83"},7,"否"]
["云南省广播电视局保山702台","会计","15399099157005001","1153991503117",{"v":211.5,"d":"211.50"},35.25,81.4,{"v":40.7,"d":"40.70"},75.95,1,"是"]
["云南省广播电视局保山702台","会计","15399099157005001","1153991501121",{"v":203.5,"d":"203.50"},{"v":33.9166666666667,"d":"33.92"},78.2,{"v":39.1,"d":"39.10"},{"v":73.0166666666667,"d":"73.02"},2,"否"]
["云南省广播电视局沧源中波台","文秘","15399099157035001","1153991501424",{"v":200,"d":"200.00"},{"v":33.3333333333333,"d":"33.33"},82.6,{"v":41.3,"d":"41.30"},{"v":74.6333333333333,"d":"74.63"},1,"是"]
["云南省广播电视局沧源中波台","文秘","15399099157035001","1153991503917",{"v":191,"d":"191.00"},{"v":31.8333333333333,"d":"31.83"},79.7,39.85,{"v":71.6833333333333,"d":"71.68"},2,"否"]
["云南省广播电视局沧源中波台","广播电视工程","15399099157035002","3153993208511",{"v":157,"d":"157.00"},{"v":26.1666666666667,"d":"26.17"},81,{"v":40.5,"d":"40.50"},{"v":66.6666666666667,"d":"66.67"},1,"是"]
["云南省广播电视局沧源中波台","广播电视工程","15399099157035002","3153993207402",{"v":156.5,"d":"156.50"},{"v":26.0833333333333,"d":"26.08"},77.8,{"v":38.9,"d":"38.90"},{"v":64.9833333333333,"d":"64.98"},2,"否"]
["云南省广播电视局大理实验台","会计","15399099157012001","1153991503422",{"v":208,"d":"208.00"},{"v":34.6666666666667,"d":"34.67"},79.2,{"v":39.6,"d":"39.60"},{"v":74.2666666666667,"d":"74.27"},1,"是"]
["云南省广播电视局大理实验台","会计","15399099157012001","1153991501928",{"v":207.5,"d":"207.50"},{"v":34.5833333333333,"d":"34.58"},78.04,39.02,{"v":73.6033333333333,"d":"73.60"},2,"否"]
["云南省广播电视局德宏705台","会计","15399099157006001","1153991502818",{"v":204,"d":"204.00"},{"v":34,"d":"34.00"},79.8,{"v":39.9,"d":"39.90"},{"v":73.9,"d":"73.90"},1,"是"]
["云南省广播电视局德宏705台","会计","15399099157006001","1153991500926",{"v":201.5,"d":"201.50"},{"v":33.5833333333333,"d":"33.58"},77.3,38.65,{"v":72.2333333333333,"d":"72.23"},2,"否"]
["云南省广播电视局迪庆实验台","文秘","15399099157011001","1153991502430",{"v":204,"d":"204.00"},{"v":34,"d":"34.00"},85.2,{"v":42.6,"d":"42.60"},{"v":76.6,"d":"76.60"},1,"是"]
["云南省广播电视局迪庆实验台","文秘","15399099157011001","1153991505711",{"v":209,"d":"209.00"},{"v":34.8333333333333,"d":"34.83"},80,{"v":40,"d":"40.00"},{"v":74.8333333333333,"d":"74.83"},2,"否"]
["云南省广播电视局迪庆实验台","广播电视工程","15399099157011002","3153993204216",{"v":150,"d":"150.00"},{"v":25,"d":"25.00"},80.6,{"v":40.3,"d":"40.30"},{"v":65.3,"d":"65.30"},1,"是 "]
["云南省广播电视局迪庆实验台","广播电视工程","15399099157011002","3153993207816",{"v":134.5,"d":"134.50"},{"v":22.4166666666667,"d":"22.42"},79.4,{"v":39.7,"d":"39.70"},{"v":62.1166666666667,"d":"62.12"},2,"否 "]
["云南省广播电视局迪庆中波台","会计","15399099157009001","1153991505807",{"v":209,"d":"209.00"},{"v":34.8333333333333,"d":"34.83"},79.1,39.55,{"v":74.3833333333333,"d":"74.38"},1,"是 "]
["云南省广播电视局迪庆中波台","会计","15399099157009001","1153991500322",{"v":198.5,"d":"198.50"},{"v":33.0833333333333,"d":"33.08"},82.2,{"v":41.1,"d":"41.10"},{"v":74.1833333333333,"d":"74.18"},2,"否 "]
["云南省广播电视局迪庆中波台","文秘","15399099157009002","1153991504306",{"v":206.5,"d":"206.50"},{"v":34.4166666666667,"d":"34.42"},82.3,41.15,{"v":75.5666666666667,"d":"75.57"},1,"是 "]
["云南省广播电视局福贡中波台","会计","15399099157033001","1153991505127",{"v":180.5,"d":"180.50"},{"v":30.0833333333333,"d":"30.08"},78.3,39.15,{"v":69.2333333333333,"d":"69.23"},1,"是 "]
["云南省广播电视局福贡中波台","会计","15399099157033001","1153991505730",{"v":169.5,"d":"169.50"},28.25,76.2,{"v":38.1,"d":"38.10"},66.35,2,"否 "]
["云南省广播电视局福贡中波台","文秘","15399099157033002","1153991500815",{"v":152,"d":"152.00"},{"v":25.3333333333333,"d":"25.33"},80,{"v":40,"d":"40.00"},{"v":65.3333333333333,"d":"65.33"},1,"是 "]
["云南省广播电视局福贡中波台","文秘","15399099157033002","1153991501820",{"v":136.5,"d":"136.50"},22.75,77.7,38.85,{"v":61.6,"d":"61.60"},2,"否 "]
{"$rows_left_out":116}
{"sheet":"Sheet1","index":1,"n_rows":145,"n_cols":12,"rows_kept":145,"merged":[[0,1,0,11]]}
[null,"云南省广播电视局2021年事业单位公开招聘工作人员综合成绩"]
["准考证号","招考单位名称","报考职位","报考职位代码","准考证","笔试成绩","（笔试成绩÷\n笔试总分×100）×50%","面试成绩","面试成绩\n×50%","综合成绩","排名","是否进入\n体检环节"]
["3153993206218",{"$f":"VLOOKUP(A3,[1]Sheet3!$B$3:$G$145,2,FALSE)","v":"云南省广播电视局安全播出监测中心"},{"$f":"VLOOKUP(A3,[1]Sheet3!$B$3:$G$145,3,FALSE)","v":"广播电视工程"},{"$f":"VLOOKUP(A3,[1]Sheet3!$B$3:$G$145,4,FALSE)","v":"15399099157001001"},{"$f":"VLOOKUP(A3,[1]Sheet3!$B$3:$G$145,1,FALSE)","v":"3153993206218"},{"$f":"VLOOKUP(A3,[2]Sheet1!$CE$2:$CS$1539,15,FALSE)","v":{"v":206.5,"d":"206.50"}},{"$f":"(F3/300*100)*0.5","v":{"v":34.4166666666667,"d":"34.42"}},{"$f":"VLOOKUP(A3,[1]Sheet3!$B$3:$G$145,6,FALSE)","v":84.2},{"$f":"H3*0.5","v":{"v":42.1,"d":"42.10"}},{"$f":"G3+I3","v":{"v":76.5166666666667,"d":"76.52"}}]
["3153993310202",{"$f":"VLOOKUP(A4,[1]Sheet3!$B$3:$G$145,2,FALSE)","v":"云南省广播电视局安全播出监测中心"},{"$f":"VLOOKUP(A4,[1]Sheet3!$B$3:$G$145,3,FALSE)","v":"广播电视工程"},{"$f":"VLOOKUP(A4,[1]Sheet3!$B$3:$G$145,4,FALSE)","v":"15399099157001001"},{"$f":"VLOOKUP(A4,[1]Sheet3!$B$3:$G$145,1,FALSE)","v":"3153993310202"},{"$f":"VLOOKUP(A4,[2]Sheet1!$CE$2:$CS$1539,15,FALSE)","v":{"v":217.5,"d":"217.50"}},36.25,{"$f":"VLOOKUP(A4,[1]Sheet3!$B$3:$G$145,6,FALSE)","v":83.6},{"v":41.8,"d":"41.80"},78.05]
["3153993309329",{"$f":"VLOOKUP(A5,[1]Sheet3!$B$3:$G$145,2,FALSE)","v":"云南省广播电视局安全播出监测中心"},{"$f":"VLOOKUP(A5,[1]Sheet3!$B$3:$G$145,3,FALSE)","v":"广播电视工程"},{"$f":"VLOOKUP(A5,[1]Sheet3!$B$3:$G$145,4,FALSE)","v":"15399099157001001"},{"$f":"VLOOKUP(A5,[1]Sheet3!$B$3:$G$145,1,FALSE)","v":"3153993309329"},{"$f":"VLOOKUP(A5,[2]Sheet1!$CE$2:$CS$1539,15,FALSE)","v":{"v":211.5,"d":"211.50"}},35.25,{"$f":"VLOOKUP(A5,[1]Sheet3!$B$3:$G$145,6,FALSE)","v":82.8},{"v":41.4,"d":"41.40"},76.65]
["3153993313623",{"$f":"VLOOKUP(A6,[1]Sheet3!$B$3:$G$145,2,FALSE)","v":"云南省广播电视局安全播出监测中心"},{"$f":"VLOOKUP(A6,[1]Sheet3!$B$3:$G$145,3,FALSE)","v":"广播电视工程"},{"$f":"VLOOKUP(A6,[1]Sheet3!$B$3:$G$145,4,FALSE)","v":"15399099157001001"},{"$f":"VLOOKUP(A6,[1]Sheet3!$B$3:$G$145,1,FALSE)","v":"3153993313623"},{"$f":"VLOOKUP(A6,[2]Sheet1!$CE$2:$CS$1539,15,FALSE)","v":{"v":205,"d":"205.00"}},{"v":34.1666666666667,"d":"34.17"},{"$f":"VLOOKUP(A6,[1]Sheet3!$B$3:$G$145,6,FALSE)","v":82.2},{"v":41.1,"d":"41.10"},{"v":75.2666666666667,"d":"75.27"}]
["3153993310321",{"$f":"VLOOKUP(A7,[1]Sheet3!$B$3:$G$145,2,FALSE)","v":"云南省广播电视局安全播出监测中心"},{"$f":"VLOOKUP(A7,[1]Sheet3!$B$3:$G$145,3,FALSE)","v":"广播电视工程"},{"$f":"VLOOKUP(A7,[1]Sheet3!$B$3:$G$145,4,FALSE)","v":"15399099157001001"},{"$f":"VLOOKUP(A7,[1]Sheet3!$B$3:$G$145,1,FALSE)","v":"3153993310321"},{"$f":"VLOOKUP(A7,[2]Sheet1!$CE$2:$CS$1539,15,FALSE)","v":{"v":205,"d":"205.00"}},{"v":34.1666666666667,"d":"34.17"},{"$f":"VLOOKUP(A7,[1]Sheet3!$B$3:$G$145,6,FALSE)","v":81.6},{"v":40.8,"d":"40.80"},{"v":74.9666666666667,"d":"74.97"}]
["3153993309915",{"$f":"VLOOKUP(A8,[1]Sheet3!$B$3:$G$145,2,FALSE)","v":"云南省广播电视局安全播出监测中心"},{"$f":"VLOOKUP(A8,[1]Sheet3!$B$3:$G$145,3,FALSE)","v":"广播电视工程"},{"$f":"VLOOKUP(A8,[1]Sheet3!$B$3:$G$145,4,FALSE)","v":"15399099157001001"},{"$f":"VLOOKUP(A8,[1]Sheet3!$B$3:$G$145,1,FALSE)","v":"3153993309915"},{"$f":"VLOOKUP(A8,[2]Sheet1!$CE$2:$CS$1539,15,FALSE)","v":{"v":211,"d":"211.00"}},{"v":35.1666666666667,"d":"35.17"},{"$f":"VLOOKUP(A8,[1]Sheet3!$B$3:$G$145,6,FALSE)","v":80.6},{"v":40.3,"d":"40.30"},{"v":75.4666666666667,"d":"75.47"}]
["3153993309624",{"$f":"VLOOKUP(A9,[1]Sheet3!$B$3:$G$145,2,FALSE)","v":"云南省广播电视局安全播出监测中心"},{"$f":"VLOOKUP(A9,[1]Sheet3!$B$3:$G$145,3,FALSE)","v":"广播电视工程"},{"$f":"VLOOKUP(A9,[1]Sheet3!$B$3:$G$145,4,FALSE)","v":"15399099157001001"},{"$f":"VLOOKUP(A9,[1]Sheet3!$B$3:$G$145,1,FALSE)","v":"3153993309624"},{"$f":"VLOOKUP(A9,[2]Sheet1!$CE$2:$CS$1539,15,FALSE)","v":{"v":206,"d":"206.00"}},{"v":34.3333333333333,"d":"34.33"},{"$f":"VLOOKUP(A9,[1]Sheet3!$B$3:$G$145,6,FALSE)","v":79},{"v":39.5,"d":"39.50"},{"v":73.8333333333333,"d":"73.83"}]
["1153991503117",{"$f":"VLOOKUP(A10,[1]Sheet3!$B$3:$G$145,2,FALSE)","v":"云南省广播电视局保山702台"},{"$f":"VLOOKUP(A10,[1]Sheet3!$B$3:$G$145,3,FALSE)","v":"会计"},{"$f":"VLOOKUP(A10,[1]Sheet3!$B$3:$G$145,4,FALSE)","v":"15399099157005001"},{"$f":"VLOOKUP(A10,[1]Sheet3!$B$3:$G$145,1,FALSE)","v":"1153991503117"},{"$f":"VLOOKUP(A10,[2]Sheet1!$CE$2:$CS$1539,15,FALSE)","v":{"v":211.5,"d":"211.50"}},35.25,{"$f":"VLOOKUP(A10,[1]Sheet3!$B$3:$G$145,6,FALSE)","v":81.4},{"v":40.7,"d":"40.70"},75.95]
["1153991501121",{"$f":"VLOOKUP(A11,[1]Sheet3!$B$3:$G$145,2,FALSE)","v":"云南省广播电视局保山702台"},{"$f":"VLOOKUP(A11,[1]Sheet3!$B$3:$G$145,3,FALSE)","v":"会计"},{"$f":"VLOOKUP(A11,[1]Sheet3!$B$3:$G$145,4,FALSE)","v":"15399099157005001"},{"$f":"VLOOKUP(A11,[1]Sheet3!$B$3:$G$145,1,FALSE)","v":"1153991501121"},{"$f":"VLOOKUP(A11,[2]Sheet1!$CE$2:$CS$1539,15,FALSE)","v":{"v":203.5,"d":"203.50"}},{"v":33.9166666666667,"d":"33.92"},{"$f":"VLOOKUP(A11,[1]Sheet3!$B$3:$G$145,6,FALSE)","v":78.2},{"v":39.1,"d":"39.10"},{"v":73.0166666666667,"d":"73.02"}]
["1153991501424",{"$f":"VLOOKUP(A12,[1]Sheet3!$B$3:$G$145,2,FALSE)","v":"云南省广播电视局沧源中波台"},{"$f":"VLOOKUP(A12,[1]Sheet3!$B$3:$G$145,3,FALSE)","v":"文秘"},{"$f":"VLOOKUP(A12,[1]Sheet3!$B$3:$G$145,4,FALSE)","v":"15399099157035001"},{"$f":"VLOOKUP(A12,[1]Sheet3!$B$3:$G$145,1,FALSE)","v":"1153991501424"},{"$f":"VLOOKUP(A12,[2]Sheet1!$CE$2:$CS$1539,15,FALSE)","v":{"v":200,"d":"200.00"}},{"v":33.3333333333333,"d":"33.33"},{"$f":"VLOOKUP(A12,[1]Sheet3!$B$3:$G$145,6,FALSE)","v":82.6},{"v":41.3,"d":"41.30"},{"v":74.6333333333333,"d":"74.63"}]
["1153991503917",{"$f":"VLOOKUP(A13,[1]Sheet3!$B$3:$G$145,2,FALSE)","v":"云南省广播电视局沧源中波台"},{"$f":"VLOOKUP(A13,[1]Sheet3!$B$3:$G$145,3,FALSE)","v":"文秘"},{"$f":"VLOOKUP(A13,[1]Sheet3!$B$3:$G$145,4,FALSE)","v":"15399099157035001"},{"$f":"VLOOKUP(A13,[1]Sheet3!$B$3:$G$145,1,FALSE)","v":"1153991503917"},{"$f":"VLOOKUP(A13,[2]Sheet1!$CE$2:$CS$1539,15,FALSE)","v":{"v":191,"d":"191.00"}},{"v":31.8333333333333,"d":"31.83"},{"$f":"VLOOKUP(A13,[1]Sheet3!$B$3:$G$145,6,FALSE)","v":79.7},39.85,{"v":71.6833333333333,"d":"71.68"}]
["3153993208511",{"$f":"VLOOKUP(A14,[1]Sheet3!$B$3:$G$145,2,FALSE)","v":"云南省广播电视局沧源中波台"},{"$f":"VLOOKUP(A14,[1]Sheet3!$B$3:$G$145,3,FALSE)","v":"广播电视工程"},{"$f":"VLOOKUP(A14,[1]Sheet3!$B$3:$G$145,4,FALSE)","v":"15399099157035002"},{"$f":"VLOOKUP(A14,[1]Sheet3!$B$3:$G$145,1,FALSE)","v":"3153993208511"},{"$f":"VLOOKUP(A14,[2]Sheet1!$CE$2:$CS$1539,15,FALSE)","v":{"v":157,"d":"157.00"}},{"v":26.1666666666667,"d":"26.17"},{"$f":"VLOOKUP(A14,[1]Sheet3!$B$3:$G$145,6,FALSE)","v":81},{"v":40.5,"d":"40.50"},{"v":66.6666666666667,"d":"66.67"}]
["3153993207402",{"$f":"VLOOKUP(A15,[1]Sheet3!$B$3:$G$145,2,FALSE)","v":"云南省广播电视局沧源中波台"},{"$f":"VLOOKUP(A15,[1]Sheet3!$B$3:$G$145,3,FALSE)","v":"广播电视工程"},{"$f":"VLOOKUP(A15,[1]Sheet3!$B$3:$G$145,4,FALSE)","v":"15399099157035002"},{"$f":"VLOOKUP(A15,[1]Sheet3!$B$3:$G$145,1,FALSE)","v":"3153993207402"},{"$f":"VLOOKUP(A15,[2]Sheet1!$CE$2:$CS$1539,15,FALSE)","v":{"v":156.5,"d":"156.50"}},{"v":26.0833333333333,"d":"26.08"},{"$f":"VLOOKUP(A15,[1]Sheet3!$B$3:$G$145,6,FALSE)","v":77.8},{"v":38.9,"d":"38.90"},{"v":64.9833333333333,"d":"64.98"}]
["1153991503422",{"$f":"VLOOKUP(A16,[1]Sheet3!$B$3:$G$145,2,FALSE)","v":"云南省广播电视局大理实验台"},{"$f":"VLOOKUP(A16,[1]Sheet3!$B$3:$G$145,3,FALSE)","v":"会计"},{"$f":"VLOOKUP(A16,[1]Sheet3!$B$3:$G$145,4,FALSE)","v":"15399099157012001"},{"$f":"VLOOKUP(A16,[1]Sheet3!$B$3:$G$145,1,FALSE)","v":"1153991503422"},{"$f":"VLOOKUP(A16,[2]Sheet1!$CE$2:$CS$1539,15,FALSE)","v":{"v":208,"d":"208.00"}},{"v":34.6666666666667,"d":"34.67"},{"$f":"VLOOKUP(A16,[1]Sheet3!$B$3:$G$145,6,FALSE)","v":79.2},{"v":39.6,"d":"39.60"},{"v":74.2666666666667,"d":"74.27"}]
["1153991501928",{"$f":"VLOOKUP(A17,[1]Sheet3!$B$3:$G$145,2,FALSE)","v":"云南省广播电视局大理实验台"},{"$f":"VLOOKUP(A17,[1]Sheet3!$B$3:$G$145,3,FALSE)","v":"会计"},{"$f":"VLOOKUP(A17,[1]Sheet3!$B$3:$G$145,4,FALSE)","v":"15399099157012001"},{"$f":"VLOOKUP(A17,[1]Sheet3!$B$3:$G$145,1,FALSE)","v":"1153991501928"},{"$f":"VLOOKUP(A17,[2]Sheet1!$CE$2:$CS$1539,15,FALSE)","v":{"v":207.5,"d":"207.50"}},{"v":34.5833333333333,"d":"34.58"},{"$f":"VLOOKUP(A17,[1]Sheet3!$B$3:$G$145,6,FALSE)","v":78.04},39.02,{"v":73.6033333333333,"d":"73.60"}]
["1153991502818",{"$f":"VLOOKUP(A18,[1]Sheet3!$B$3:$G$145,2,FALSE)","v":"云南省广播电视局德宏705台"},{"$f":"VLOOKUP(A18,[1]Sheet3!$B$3:$G$145,3,FALSE)","v":"会计"},{"$f":"VLOOKUP(A18,[1]Sheet3!$B$3:$G$145,4,FALSE)","v":"15399099157006001"},{"$f":"VLOOKUP(A18,[1]Sheet3!$B$3:$G$145,1,FALSE)","v":"1153991502818"},{"$f":"VLOOKUP(A18,[2]Sheet1!$CE$2:$CS$1539,15,FALSE)","v":{"v":204,"d":"204.00"}},{"v":34,"d":"34.00"},{"$f":"VLOOKUP(A18,[1]Sheet3!$B$3:$G$145,6,FALSE)","v":79.8},{"v":39.9,"d":"39.90"},{"v":73.9,"d":"73.90"}]
["1153991500926",{"$f":"VLOOKUP(A19,[1]Sheet3!$B$3:$G$145,2,FALSE)","v":"云南省广播电视局德宏705台"},{"$f":"VLOOKUP(A19,[1]Sheet3!$B$3:$G$145,3,FALSE)","v":"会计"},{"$f":"VLOOKUP(A19,[1]Sheet3!$B$3:$G$145,4,FALSE)","v":"15399099157006001"},{"$f":"VLOOKUP(A19,[1]Sheet3!$B$3:$G$145,1,FALSE)","v":"1153991500926"},{"$f":"VLOOKUP(A19,[2]Sheet1!$CE$2:$CS$1539,15,FALSE)","v":{"v":201.5,"d":"201.50"}},{"v":33.5833333333333,"d":"33.58"},{"$f":"VLOOKUP(A19,[1]Sheet3!$B$3:$G$145,6,FALSE)","v":77.3},38.65,{"v":72.2333333333333,"d":"72.23"}]
["1153991502430",{"$f":"VLOOKUP(A20,[1]Sheet3!$B$3:$G$145,2,FALSE)","v":"云南省广播电视局迪庆实验台"},{"$f":"VLOOKUP(A20,[1]Sheet3!$B$3:$G$145,3,FALSE)","v":"文秘"},{"$f":"VLOOKUP(A20,[1]Sheet3!$B$3:$G$145,4,FALSE)","v":"15399099157011001"},{"$f":"VLOOKUP(A20,[1]Sheet3!$B$3:$G$145,1,FALSE)","v":"1153991502430"},{"$f":"VLOOKUP(A20,[2]Sheet1!$CE$2:$CS$1539,15,FALSE)","v":{"v":204,"d":"204.00"}},{"v":34,"d":"34.00"},{"$f":"VLOOKUP(A20,[1]Sheet3!$B$3:$G$145,6,FALSE)","v":85.2},{"v":42.6,"d":"42.60"},{"v":76.6,"d":"76.60"}]
["1153991505711",{"$f":"VLOOKUP(A21,[1]Sheet3!$B$3:$G$145,2,FALSE)","v":"云南省广播电视局迪庆实验台"},{"$f":"VLOOKUP(A21,[1]Sheet3!$B$3:$G$145,3,FALSE)","v":"文秘"},{"$f":"VLOOKUP(A21,[1]Sheet3!$B$3:$G$145,4,FALSE)","v":"15399099157011001"},{"$f":"VLOOKUP(A21,[1]Sheet3!$B$3:$G$145,1,FALSE)","v":"1153991505711"},{"$f":"VLOOKUP(A21,[2]Sheet1!$CE$2:$CS$1539,15,FALSE)","v":{"v":209,"d":"209.00"}},{"v":34.8333333333333,"d":"34.83"},{"$f":"VLOOKUP(A21,[1]Sheet3!$B$3:$G$145,6,FALSE)","v":80},{"v":40,"d":"40.00"},{"v":74.8333333333333,"d":"74.83"}]
["3153993204216",{"$f":"VLOOKUP(A22,[1]Sheet3!$B$3:$G$145,2,FALSE)","v":"云南省广播电视局迪庆实验台"},{"$f":"VLOOKUP(A22,[1]Sheet3!$B$3:$G$145,3,FALSE)","v":"广播电视工程"},{"$f":"VLOOKUP(A22,[1]Sheet3!$B$3:$G$145,4,FALSE)","v":"15399099157011002"},{"$f":"VLOOKUP(A22,[1]Sheet3!$B$3:$G$145,1,FALSE)","v":"3153993204216"},{"$f":"VLOOKUP(A22,[2]Sheet1!$CE$2:$CS$1539,15,FALSE)","v":{"v":150,"d":"150.00"}},{"v":25,"d":"25.00"},{"$f":"VLOOKUP(A22,[1]Sheet3!$B$3:$G$145,6,FALSE)","v":80.6},{"v":40.3,"d":"40.30"},{"v":65.3,"d":"65.30"}]
["3153993207816",{"$f":"VLOOKUP(A23,[1]Sheet3!$B$3:$G$145,2,FALSE)","v":"云南省广播电视局迪庆实验台"},{"$f":"VLOOKUP(A23,[1]Sheet3!$B$3:$G$145,3,FALSE)","v":"广播电视工程"},{"$f":"VLOOKUP(A23,[1]Sheet3!$B$3:$G$145,4,FALSE)","v":"15399099157011002"},{"$f":"VLOOKUP(A23,[1]Sheet3!$B$3:$G$145,1,FALSE)","v":"3153993207816"},{"$f":"VLOOKUP(A23,[2]Sheet1!$CE$2:$CS$1539,15,FALSE)","v":{"v":134.5,"d":"134.50"}},{"v":22.4166666666667,"d":"22.42"},{"$f":"VLOOKUP(A23,[1]Sheet3!$B$3:$G$145,6,FALSE)","v":79.4},{"v":39.7,"d":"39.70"},{"v":62.1166666666667,"d":"62.12"}]
["1153991500322",{"$f":"VLOOKUP(A24,[1]Sheet3!$B$3:$G$145,2,FALSE)","v":"云南省广播电视局迪庆中波台"},{"$f":"VLOOKUP(A24,[1]Sheet3!$B$3:$G$145,3,FALSE)","v":"会计"},{"$f":"VLOOKUP(A24,[1]Sheet3!$B$3:$G$145,4,FALSE)","v":"15399099157009001"},{"$f":"VLOOKUP(A24,[1]Sheet3!$B$3:$G$145,1,FALSE)","v":"1153991500322"},{"$f":"VLOOKUP(A24,[2]Sheet1!$CE$2:$CS$1539,15,FALSE)","v":{"v":198.5,"d":"198.50"}},{"v":33.0833333333333,"d":"33.08"},{"$f":"VLOOKUP(A24,[1]Sheet3!$B$3:$G$145,6,FALSE)","v":82.2},{"v":41.1,"d":"41.10"},{"v":74.1833333333333,"d":"74.18"}]
["1153991505807",{"$f":"VLOOKUP(A25,[1]Sheet3!$B$3:$G$145,2,FALSE)","v":"云南省广播电视局迪庆中波台"},{"$f":"VLOOKUP(A25,[1]Sheet3!$B$3:$G$145,3,FALSE)","v":"会计"},{"$f":"VLOOKUP(A25,[1]Sheet3!$B$3:$G$145,4,FALSE)","v":"15399099157009001"},{"$f":"VLOOKUP(A25,[1]Sheet3!$B$3:$G$145,1,FALSE)","v":"1153991505807"},{"$f":"VLOOKUP(A25,[2]Sheet1!$CE$2:$CS$1539,15,FALSE)","v":{"v":209,"d":"209.00"}},{"v":34.8333333333333,"d":"34.83"},{"$f":"VLOOKUP(A25,[1]Sheet3!$B$3:$G$145,6,FALSE)","v":79.1},39.55,{"v":74.3833333333333,"d":"74.38"}]
["1153991504306",{"$f":"VLOOKUP(A26,[1]Sheet3!$B$3:$G$145,2,FALSE)","v":"云南省广播电视局迪庆中波台"},{"$f":"VLOOKUP(A26,[1]Sheet3!$B$3:$G$145,3,FALSE)","v":"文秘"},{"$f":"VLOOKUP(A26,[1]Sheet3!$B$3:$G$145,4,FALSE)","v":"15399099157009002"},{"$f":"VLOOKUP(A26,[1]Sheet3!$B$3:$G$145,1,FALSE)","v":"1153991504306"},{"$f":"VLOOKUP(A26,[2]Sheet1!$CE$2:$CS$1539,15,FALSE)","v":{"v":206.5,"d":"206.50"}},{"v":34.4166666666667,"d":"34.42"},{"$f":"VLOOKUP(A26,[1]Sheet3!$B$3:$G$145,6,FALSE)","v":82.3},41.15,{"v":75.5666666666667,"d":"75.57"}]
["1153991505127",{"$f":"VLOOKUP(A27,[1]Sheet3!$B$3:$G$145,2,FALSE)","v":"云南省广播电视局福贡中波台"},{"$f":"VLOOKUP(A27,[1]Sheet3!$B$3:$G$145,3,FALSE)","v":"会计"},{"$f":"VLOOKUP(A27,[1]Sheet3!$B$3:$G$145,4,FALSE)","v":"15399099157033001"},{"$f":"VLOOKUP(A27,[1]Sheet3!$B$3:$G$145,1,FALSE)","v":"1153991505127"},{"$f":"VLOOKUP(A27,[2]Sheet1!$CE$2:$CS$1539,15,FALSE)","v":{"v":180.5,"d":"180.50"}},{"v":30.0833333333333,"d":"30.08"},{"$f":"VLOOKUP(A27,[1]Sheet3!$B$3:$G$145,6,FALSE)","v":78.3},39.15,{"v":69.2333333333333,"d":"69.23"}]
["1153991505730",{"$f":"VLOOKUP(A28,[1]Sheet3!$B$3:$G$145,2,FALSE)","v":"云南省广播电视局福贡中波台"},{"$f":"VLOOKUP(A28,[1]Sheet3!$B$3:$G$145,3,FALSE)","v":"会计"},{"$f":"VLOOKUP(A28,[1]Sheet3!$B$3:$G$145,4,FALSE)","v":"15399099157033001"},{"$f":"VLOOKUP(A28,[1]Sheet3!$B$3:$G$145,1,FALSE)","v":"1153991505730"},{"$f":"VLOOKUP(A28,[2]Sheet1!$CE$2:$CS$1539,15,FALSE)","v":{"v":169.5,"d":"169.50"}},28.25,{"$f":"VLOOKUP(A28,[1]Sheet3!$B$3:$G$145,6,FALSE)","v":76.2},{"v":38.1,"d":"38.10"},66.35]
["1153991500815",{"$f":"VLOOKUP(A29,[1]Sheet3!$B$3:$G$145,2,FALSE)","v":"云南省广播电视局福贡中波台"},{"$f":"VLOOKUP(A29,[1]Sheet3!$B$3:$G$145,3,FALSE)","v":"文秘"},{"$f":"VLOOKUP(A29,[1]Sheet3!$B$3:$G$145,4,FALSE)","v":"15399099157033002"},{"$f":"VLOOKUP(A29,[1]Sheet3!$B$3:$G$145,1,FALSE)","v":"1153991500815"},{"$f":"VLOOKUP(A29,[2]Sheet1!$CE$2:$CS$1539,15,FALSE)","v":{"v":152,"d":"152.00"}},{"v":25.3333333333333,"d":"25.33"},{"$f":"VLOOKUP(A29,[1]Sheet3!$B$3:$G$145,6,FALSE)","v":80},{"v":40,"d":"40.00"},{"v":65.3333333333333,"d":"65.33"}]
["1153991501820",{"$f":"VLOOKUP(A30,[1]Sheet3!$B$3:$G$145,2,FALSE)","v":"云南省广播电视局福贡中波台"},{"$f":"VLOOKUP(A30,[1]Sheet3!$B$3:$G$145,3,FALSE)","v":"文秘"},{"$f":"VLOOKUP(A30,[1]Sheet3!$B$3:$G$145,4,FALSE)","v":"15399099157033002"},{"$f":"VLOOKUP(A30,[1]Sheet3!$B$3:$G$145,1,FALSE)","v":"1153991501820"},{"$f":"VLOOKUP(A30,[2]Sheet1!$CE$2:$CS$1539,15,FALSE)","v":{"v":136.5,"d":"136.50"}},22.75,{"$f":"VLOOKUP(A30,[1]Sheet3!$B$3:$G$145,6,FALSE)","v":77.7},38.85,{"v":61.6,"d":"61.60"}]
{"$rows_left_out":115}